Reaction Details
TargetCollagenase 3
LigandBDBM50234334
Substrate/Competitorn/a
Meas. Tech.ChEMBL_1433222 (CHEMBL3388189)
IC50 30±n/a nM
Citation Fabre, BRamos, Ade Pascual-Teresa, B Targeting matrix metalloproteinases: exploring the dynamics of the s1' pocket in the design of selective, small molecule inhibitors. J Med Chem57:10205-19 (2014) 
 
Collagenase 3
Name:Collagenase 3
Type:Enzyme
Mol. Mass.:53808.06
Organism:Homo sapiens (Human)
Description:P45452
Residue:471
BDBM50234334
NameBDBM50234334
Synonyms:BENZYL 6-BENZYL-5,7-DIOXO-6,7-DIHYDRO-5H-[1,3]THIAZOLO[3,2-C]PYRIMIDINE-2-CARBOXYLATE benzyl 6-benzyl-5,7-dioxo-6,7-dihydro-5H-thiazolo[3,2-c]pyrimidine-2-carboxylate | benzyl 6-benzyl-5,7-dioxo-6,7-dihydro-5H-thiazolo[3,2-f]pyrimidine-2-carboxylate
TypeSmall organic molecule
Emp. Form.C21H16N2O4S
Mol. Mass.392.428
SMILESO=C(OCc1ccccc1)c1cn2c(cc(=O)n(Cc3ccccc3)c2=O)s1