Reaction Details
TargetInterstitial collagenase
LigandBDBM50028942
Substrate/Competitorn/a
Meas. Tech.ChEMBL_1432368 (CHEMBL3384473)
Ki 23±n/a nM
Citation Fabre, BRamos, Ade Pascual-Teresa, B Targeting matrix metalloproteinases: exploring the dynamics of the s1' pocket in the design of selective, small molecule inhibitors. J Med Chem57:10205-19 (2014) 
 
Interstitial collagenase
Name:Interstitial collagenase
Type:Enzyme
Mol. Mass.:54010.26
Organism:Homo sapiens (Human)
Description: P03956
Residue:469
BDBM50028942
NameBDBM50028942
Synonyms:CHEMBL1235735
TypeSmall organic molecule
Emp. Form.C19H21NO6S
Mol. Mass.391.438
SMILESONC(=O)CC1(CCOCC1)S(=O)(=O)c1ccc(Oc2ccccc2)cc1