Reaction Details
TargetCarbonic anhydrase 2
LigandBDBM50029067
Substrate/Competitorn/a
Meas. Tech.ChEMBL_1435513 (CHEMBL3385333)
Ki 682±n/a nM
Citation Sarikaya, BCeruso, MCarta, FSupuran, CT Inhibition of carbonic anhydrase isoforms I, II, IX and XII with novel Schiff bases: identification of selective inhibitors for the tumor-associated isoforms over the cytosolic ones. Bioorg Med Chem22:5883-90 (2014) 
 
Carbonic anhydrase 2
Name:Carbonic anhydrase 2
Type:Enzyme
Mol. Mass.:29250.71
Organism:Homo sapiens (Human)
Description:P00918
Residue:260
BDBM50029067
NameBDBM50029067
Synonyms:CHEMBL3343262
TypeSmall organic molecule
Emp. Form.C18H15N3O2S
Mol. Mass.337.396
SMILESNS(=O)(=O)c1ccc(cc1)\N=C\c1ccc(cc1)-c1ccccn1