Reaction Details
TargetCarbonic anhydrase 2
LigandBDBM50029082
Substrate/Competitorn/a
Meas. Tech.ChEMBL_1435513 (CHEMBL3385333)
Ki 596±n/a nM
Citation Sarikaya, BCeruso, MCarta, FSupuran, CT Inhibition of carbonic anhydrase isoforms I, II, IX and XII with novel Schiff bases: identification of selective inhibitors for the tumor-associated isoforms over the cytosolic ones. Bioorg Med Chem22:5883-90 (2014) 
 
Carbonic anhydrase 2
Name:Carbonic anhydrase 2
Type:Enzyme
Mol. Mass.:29250.71
Organism:Homo sapiens (Human)
Description:P00918
Residue:260
BDBM50029082
NameBDBM50029082
Synonyms:CHEMBL3343276
TypeSmall organic molecule
Emp. Form.C17H16BrN3O2S
Mol. Mass.406.297
SMILESNS(=O)(=O)c1ccc(CC\N=C\c2c[nH]c3ccc(Br)cc23)cc1