Reaction Details
TargetCarbonic anhydrase 9
LigandBDBM50029068
Substrate/Competitorn/a
Meas. Tech.ChEMBL_1435514 (CHEMBL3385334)
Ki 197±n/a nM
Citation Sarikaya, BCeruso, MCarta, FSupuran, CT Inhibition of carbonic anhydrase isoforms I, II, IX and XII with novel Schiff bases: identification of selective inhibitors for the tumor-associated isoforms over the cytosolic ones. Bioorg Med Chem22:5883-90 (2014) 
 
Carbonic anhydrase 9
Name:Carbonic anhydrase 9
Type:Enzyme
Mol. Mass.:49669.03
Organism:Homo sapiens (Human)
Description:Catalytic domain of human cloned isozyme was used in the assay
Residue:459
BDBM50029068
NameBDBM50029068
Synonyms:CHEMBL3343263
TypeSmall organic molecule
Emp. Form.C15H12N2O2S2
Mol. Mass.316.398
SMILESNS(=O)(=O)c1ccc(cc1)\N=C\c1csc2ccccc12