Reaction Details
TargetCannabinoid receptor 1
LigandBDBM50029960
Substrate/Competitorn/a
Meas. Tech.ChEMBL_1438383 (CHEMBL3383058)
Ki>10000±n/a nM
Citation Lucchesi, VHurst, DPShore, DMBertini, SEhrmann, BMAllarà, MLawrence, LLigresti, AMinutolo, FSaccomanni, GSharir, HMacchia, MDi Marzo, VAbood, MEReggio, PHManera, C CB2-selective cannabinoid receptor ligands: synthesis, pharmacological evaluation, and molecular modeling investigation of 1,8-Naphthyridin-2(1H)-one-3-carboxamides. J Med Chem57:8777-91 (2014) 
 
Cannabinoid receptor 1
Name:Cannabinoid receptor 1
Type:G Protein-Coupled Receptor (GPCR)
Mol. Mass.:52868.96
Organism:Homo sapiens (Human)
Description:P21554
Residue:472
BDBM50029960
NameBDBM50029960
Synonyms:CHEMBL3353451
TypeSmall organic molecule
Emp. Form.C29H36N4O4
Mol. Mass.504.6205
SMILESCOc1ccc(cc1)-c1cnc2n(CCN3CCOCC3)c(=O)c(cc2c1)C(=O)NC1CCC(C)CC1