Reaction Details
TargetCannabinoid receptor 1
LigandBDBM50030084
Substrate/Competitorn/a
Meas. Tech.ChEMBL_1438383 (CHEMBL3383058)
Ki>10000±n/a nM
Citation Lucchesi, VHurst, DPShore, DMBertini, SEhrmann, BMAllarà, MLawrence, LLigresti, AMinutolo, FSaccomanni, GSharir, HMacchia, MDi Marzo, VAbood, MEReggio, PHManera, C CB2-selective cannabinoid receptor ligands: synthesis, pharmacological evaluation, and molecular modeling investigation of 1,8-Naphthyridin-2(1H)-one-3-carboxamides. J Med Chem57:8777-91 (2014) 
 
Cannabinoid receptor 1
Name:Cannabinoid receptor 1
Type:G Protein-Coupled Receptor (GPCR)
Mol. Mass.:52868.96
Organism:Homo sapiens (Human)
Description:P21554
Residue:472
BDBM50030084
NameBDBM50030084
Synonyms:CHEMBL3353430
TypeSmall organic molecule
Emp. Form.C21H27N3O4
Mol. Mass.385.4568
SMILESCCOC(=O)CCn1c2ncccc2cc(C(=O)NC2CCC(C)CC2)c1=O