Reaction Details
TargetMuscarinic acetylcholine receptor M1
LigandBDBM50030248
Substrate/Competitorn/a
Meas. Tech.ChEMBL_1438413 (CHEMBL3383642)
Ki 123±n/a nM
Citation Bonifazi, AYano, HDel Bello, FFarande, AQuaglia, WPetrelli, RMatucci, RNesi, MVistoli, GFerré, SPiergentili, A Synthesis and biological evaluation of a novel series of heterobivalent muscarinic ligands based on xanomeline and 1-[3-(4-butylpiperidin-1-yl)propyl]-1,2,3,4-tetrahydroquinolin-2-one (77-LH-28-1). J Med Chem57:9065-77 (2014) 
 
Muscarinic acetylcholine receptor M1
Name:Muscarinic acetylcholine receptor M1
Type:Protein
Mol. Mass.:51442.54
Organism:Homo sapiens (Human)
Description:P11229
Residue:460
BDBM50030248
NameBDBM50030248
Synonyms:CHEMBL3354076
TypeSmall organic molecule
Emp. Form.C28H46N2O2
Mol. Mass.442.677
SMILESOCCCCCCCCCCCC1CCN(CCCN2C(=O)CCc3ccccc23)CC1