Reaction Details
TargetMuscarinic acetylcholine receptor M4
LigandBDBM50030221
Substrate/Competitorn/a
Meas. Tech.ChEMBL_1438416 (CHEMBL3383645)
Ki 26±n/a nM
Citation Bonifazi, AYano, HDel Bello, FFarande, AQuaglia, WPetrelli, RMatucci, RNesi, MVistoli, GFerré, SPiergentili, A Synthesis and biological evaluation of a novel series of heterobivalent muscarinic ligands based on xanomeline and 1-[3-(4-butylpiperidin-1-yl)propyl]-1,2,3,4-tetrahydroquinolin-2-one (77-LH-28-1). J Med Chem57:9065-77 (2014) 
 
Muscarinic acetylcholine receptor M4
Name:Muscarinic acetylcholine receptor M4
Type:Enzyme Catalytic Domain
Mol. Mass.:53079.31
Organism:Homo sapiens (Human)
Description:Cholinergic, muscarinic M4 CHRM4 HUMAN M3::P08173
Residue:479
BDBM50030221
NameBDBM50030221
Synonyms:CHEMBL3354066
TypeSmall organic molecule
Emp. Form.C28H39N5O2S
Mol. Mass.509.707
SMILESCN1CCC=C(C1)c1nsnc1OCCCC1CCN(CCCN2C(=O)CCc3ccccc23)CC1