Reaction Details
TargetMuscarinic acetylcholine receptor M4
LigandBDBM50107696
Substrate/Competitorn/a
Meas. Tech.ChEMBL_1438416 (CHEMBL3383645)
Ki 0.776247±n/a nM
Citation Bonifazi, AYano, HDel Bello, FFarande, AQuaglia, WPetrelli, RMatucci, RNesi, MVistoli, GFerré, SPiergentili, A Synthesis and biological evaluation of a novel series of heterobivalent muscarinic ligands based on xanomeline and 1-[3-(4-butylpiperidin-1-yl)propyl]-1,2,3,4-tetrahydroquinolin-2-one (77-LH-28-1). J Med Chem57:9065-77 (2014) 
 
Muscarinic acetylcholine receptor M4
Name:Muscarinic acetylcholine receptor M4
Type:Enzyme Catalytic Domain
Mol. Mass.:53079.31
Organism:Homo sapiens (Human)
Description:Cholinergic, muscarinic M4 CHRM4 HUMAN M3::P08173
Residue:479
BDBM50107696
NameBDBM50107696
Synonyms:1,9-di[4-(1-methyl-1,2,3,6-tetrahydro-5-pyridinyl)-1,2,5-thiadiazol-3-yloxy]nonane | CHEMBL143469
TypeSmall organic molecule
Emp. Form.C25H38N6O2S2
Mol. Mass.518.738
SMILESCN1CCC=C(C1)c1nsnc1OCCCCCCCCCOc1nsnc1C1=CCCN(C)C1