Reaction Details
TargetLysosomal alpha-mannosidase
LigandBDBM50030374
Substrate/Competitorn/a
Meas. Tech.ChEMBL_1432452 (CHEMBL3385734)
IC50 112000±n/a nM
Citation Markad, PRSonawane, DPGhosh, SChopade, BAKumbhar, NLouat, THerman, JWaer, MHerdewijn, PDhavale, DD ¿-Hydroxyethyl piperidine iminosugar and N-alkylated derivatives: a study of their activity as glycosidase inhibitors and as immunosuppressive agents. Bioorg Med Chem22:5776-82 (2014) 
 
Lysosomal alpha-mannosidase
Name:Lysosomal alpha-mannosidase
Type:PROTEIN
Mol. Mass.:113753.32
Organism:Homo sapiens (Human)
Description:ChEMBL_1432452
Residue:1011
BDBM50030374
NameBDBM50030374
Synonyms:CHEMBL3344206
TypeSmall organic molecule
Emp. Form.C17H35NO4
Mol. Mass.317.4641
SMILESCCCCCCCCCCN1C[C@H](O)C(O)(CCO)[C@H](O)C1