Reaction Details
TargetReceptor tyrosine-protein kinase erbB-2
LigandBDBM50030375
Substrate/Competitorn/a
Meas. Tech.ChEMBL_1432457 (CHEMBL3385739)
IC50 52±n/a nM
Citation Lyu, AFang, LGou, S Design and synthesis of Lapatinib derivatives containing a branched side chain as HER1/HER2 targeting antitumor drug candidates. Eur J Med Chem87:631-42 (2014) 
 
Receptor tyrosine-protein kinase erbB-2
Name:Receptor tyrosine-protein kinase erbB-2
Type:n/a
Mol. Mass.:137894.47
Organism:Homo sapiens (Human)
Description:P04626
Residue:1255
BDBM50030375
NameBDBM50030375
Synonyms:CHEMBL3344214
TypeSmall organic molecule
Emp. Form.C31H30ClFN4O6S2
Mol. Mass.673.175
SMILESCS(=O)(=O)CCNC(CS(C)(=O)=O)c1ccc(o1)-c1ccc2ncnc(Nc3ccc(OCc4cccc(F)c4)c(Cl)c3)c2c1