Reaction Details
TargetGenome polyprotein
LigandBDBM50030463
Substrate/Competitorn/a
Meas. Tech.ChEMBL_1434201 (CHEMBL3384009)
Ki 31100±n/a nM
Citation Bhakat, SKarubiu, WJayaprakash, VSoliman, ME A perspective on targeting non-structural proteins to combat neglected tropical diseases: Dengue, West Nile and Chikungunya viruses. Eur J Med Chem87:677-702 (2014) 
 
Genome polyprotein
Name:Genome polyprotein
Synonyms:Genome polyprotein
Type:PROTEIN
Mol. Mass.:379401.14
Organism:Dengue virus 2
Description:ChEMBL_109733
Residue:3391
BDBM50030463
NameBDBM50030463
Synonyms:CHEMBL3361440
TypeSmall organic molecule
Emp. Form.C15H13N4O2
Mol. Mass.281.2888
SMILESNC(=[NH2+])Nc1ccc(cc1)C(=O)Oc1ccc(cc1)C#N