Reaction Details
TargetGenome polyprotein
LigandBDBM50030473
Substrate/Competitorn/a
Meas. Tech.ChEMBL_1434196 (CHEMBL3384004)
Ki 4000±n/a nM
Citation Bhakat, SKarubiu, WJayaprakash, VSoliman, ME A perspective on targeting non-structural proteins to combat neglected tropical diseases: Dengue, West Nile and Chikungunya viruses. Eur J Med Chem87:677-702 (2014) 
 
Genome polyprotein
Name:Genome polyprotein
Synonyms:Genome polyprotein
Type:PROTEIN
Mol. Mass.:379401.14
Organism:Dengue virus 2
Description:ChEMBL_109733
Residue:3391
BDBM50030473
NameBDBM50030473
Synonyms:CHEMBL3344304
TypeSmall organic molecule
Emp. Form.C24H26ClN7O2
Mol. Mass.479.962
SMILESCCN(CC)CCn1c(NC(=O)c2ccc(Cn3nc(C#N)c(Cl)c3C)o2)nc2ccccc12