Reaction Details
TargetGenome polyprotein
LigandBDBM50030471
Substrate/Competitorn/a
Meas. Tech.ChEMBL_1434196 (CHEMBL3384004)
Ki 4900±n/a nM
Citation Bhakat, SKarubiu, WJayaprakash, VSoliman, ME A perspective on targeting non-structural proteins to combat neglected tropical diseases: Dengue, West Nile and Chikungunya viruses. Eur J Med Chem87:677-702 (2014) 
 
Genome polyprotein
Name:Genome polyprotein
Synonyms:Genome polyprotein
Type:PROTEIN
Mol. Mass.:379401.14
Organism:Dengue virus 2
Description:ChEMBL_109733
Residue:3391
BDBM50030471
NameBDBM50030471
Synonyms:CHEMBL3344305
TypeSmall organic molecule
Emp. Form.C26H19N3O4
Mol. Mass.437.4468
SMILESCC(=O)N1N=C(OC1c1ccc(cc1)C(O)=O)c1cc(nc2ccccc12)-c1ccccc1