Reaction Details
TargetGenome polyprotein
LigandBDBM50030464
Substrate/Competitorn/a
Meas. Tech.ChEMBL_1434202 (CHEMBL3384010)
Ki 4200±n/a nM
Citation Bhakat, SKarubiu, WJayaprakash, VSoliman, ME A perspective on targeting non-structural proteins to combat neglected tropical diseases: Dengue, West Nile and Chikungunya viruses. Eur J Med Chem87:677-702 (2014) 
 
Genome polyprotein
Name:Genome polyprotein
Synonyms:Genome polyprotein
Type:PROTEIN
Mol. Mass.:379401.14
Organism:Dengue virus 2
Description:ChEMBL_109733
Residue:3391
BDBM50030464
NameBDBM50030464
Synonyms:CHEMBL3344310
TypeSmall organic molecule
Emp. Form.C34H37N7O5S
Mol. Mass.655.766
SMILESN[C@@H](Cc1c[nH]c2ccccc12)C(=O)N[C@@H](Cc1ccc(O)cc1)C(=O)N[C@@H](CS)C(=O)N[C@@H](Cc1c[nH]c2ccccc12)C(N)=O