Reaction Details
TargetPeroxisome proliferator-activated receptor alpha
LigandBDBM50099491
Substrate/Competitorn/a
Meas. Tech.ChEMBL_1434930 (CHEMBL3385867)
EC50 0.890000±n/a nM
Citation Gege, CSchlüter, THoffmann, T Identification of the first inverse agonist of retinoid-related orphan receptor (ROR) with dual selectivity for RORß and ROR¿t. Bioorg Med Chem Lett24:5265-7 (2014) 
 
Peroxisome proliferator-activated receptor alpha
Name:Peroxisome proliferator-activated receptor alpha
Type:Enzyme
Mol. Mass.:52222.08
Organism:Homo sapiens (Human)
Description:Q07869
Residue:468
BDBM50099491
NameBDBM50099491
Synonyms:2-(4-(2-(3-cyclohexyl-1-(4-cyclohexylbutyl)ureido)ethyl)phenylthio)-2-methylpropanoic acid CHEMBL21241 cid_3392731
TypeSmall organic molecule
Emp. Form.C29H46N2O3S
Mol. Mass.502.752
SMILESCC(C)(Sc1ccc(CCN(CCCCC2CCCCC2)C(=O)NC2CCCCC2)cc1)C(O)=O