Reaction Details
TargetNuclear receptor subfamily 1 group I member 3
LigandBDBM50030476
Substrate/Competitorn/a
Meas. Tech.ChEMBL_1434936 (CHEMBL3385873)
EC50 75±n/a nM
Citation Gege, CSchlüter, THoffmann, T Identification of the first inverse agonist of retinoid-related orphan receptor (ROR) with dual selectivity for RORß and ROR¿t. Bioorg Med Chem Lett24:5265-7 (2014) 
 
Nuclear receptor subfamily 1 group I member 3
Name:Nuclear receptor subfamily 1 group I member 3
Type:PROTEIN
Mol. Mass.:39953.17
Organism:Homo sapiens (Human)
Description:ChEMBL_1434936
Residue:352
BDBM50030476
NameBDBM50030476
Synonyms:CHEMBL458603
TypeSmall organic molecule
Emp. Form.C19H12Cl3N3OS
Mol. Mass.436.742
SMILESClc1ccc(cc1)-c1nc2sccn2c1\C=N\OCc1ccc(Cl)c(Cl)c1