Reaction Details
TargetD(2) dopamine receptor
LigandBDBM50030491
Substrate/Competitorn/a
Meas. Tech.ChEMBL_1435675 (CHEMBL3387736)
Ki 12±n/a nM
Citation Li, ZHuang, JSun, HZhou, SGuo, LZhou, YZhen, XLiu, H Design, synthesis and evaluation of benzo[a]thieno[3,2-g]quinolizines as novel l-SPD derivatives possessing dopamine D1, D2 and serotonin 5-HT1A multiple action profiles. Bioorg Med Chem22:5838-46 (2014) 
 
D(2) dopamine receptor
Name:D(2) dopamine receptor
Type:Cell-surface receptors
Mol. Mass.:50647.10
Organism:Homo sapiens (Human)
Description:P14416
Residue:443
BDBM50030491
NameBDBM50030491
Synonyms:CHEMBL3344470
TypeSmall organic molecule
Emp. Form.C20H24ClNO2S
Mol. Mass.377.928
SMILES[H][C@@]12Cc3sc(CCCCCl)cc3CN1CCc1cc(OC)c(O)cc21