Reaction Details
TargetCarbonic anhydrase 1
LigandBDBM50030556
Substrate/Competitorn/a
Meas. Tech.ChEMBL_1436379 (CHEMBL3389582)
Ki 73±n/a nM
Citation Bozdag, MFerraroni, MCarta, FVullo, DLucarini, LOrlandini, ERossello, ANuti, EScozzafava, AMasini, ESupuran, CT Structural insights on carbonic anhydrase inhibitory action, isoform selectivity, and potency of sulfonamides and coumarins incorporating arylsulfonylureido groups. J Med Chem57:9152-67 (2014) 
 
Carbonic anhydrase 1
Name:Carbonic anhydrase 1
Type:Enzyme
Mol. Mass.:28873.37
Organism:Homo sapiens (Human)
Description:P00915
Residue:261
BDBM50030556
NameBDBM50030556
Synonyms:CHEMBL3354126
TypeSmall organic molecule
Emp. Form.C12H12N4O5S2
Mol. Mass.356.377
SMILESNS(=O)(=O)c1ccc(NC(=O)NS(=O)(=O)c2ccccc2)cn1