Reaction Details
TargetCarbonic anhydrase 1
LigandBDBM50030618
Substrate/Competitorn/a
Meas. Tech.ChEMBL_1436379 (CHEMBL3389582)
Ki 83±n/a nM
Citation Bozdag, MFerraroni, MCarta, FVullo, DLucarini, LOrlandini, ERossello, ANuti, EScozzafava, AMasini, ESupuran, CT Structural insights on carbonic anhydrase inhibitory action, isoform selectivity, and potency of sulfonamides and coumarins incorporating arylsulfonylureido groups. J Med Chem57:9152-67 (2014) 
 
Carbonic anhydrase 1
Name:Carbonic anhydrase 1
Type:Enzyme
Mol. Mass.:28873.37
Organism:Homo sapiens (Human)
Description:P00915
Residue:261
BDBM50030618
NameBDBM50030618
Synonyms:CHEMBL3354135
TypeSmall organic molecule
Emp. Form.C15H16FN3O5S2
Mol. Mass.401.433
SMILESNS(=O)(=O)c1ccc(CCNC(=O)NS(=O)(=O)c2ccc(F)cc2)cc1