Reaction Details
TargetCarbonic anhydrase 12
LigandBDBM50030620
Substrate/Competitorn/a
Meas. Tech.ChEMBL_1436382 (CHEMBL3389585)
Ki 5.1±n/a nM
Citation Bozdag, MFerraroni, MCarta, FVullo, DLucarini, LOrlandini, ERossello, ANuti, EScozzafava, AMasini, ESupuran, CT Structural insights on carbonic anhydrase inhibitory action, isoform selectivity, and potency of sulfonamides and coumarins incorporating arylsulfonylureido groups. J Med Chem57:9152-67 (2014) 
 
Carbonic anhydrase 12
Name:Carbonic anhydrase 12
Type:Enzyme
Mol. Mass.:39456.00
Organism:Homo sapiens (Human)
Description:Catalytic domain of human cloned isozyme was used in the assay
Residue:354
BDBM50030620
NameBDBM50030620
Synonyms:CHEMBL3354136
TypeSmall organic molecule
Emp. Form.C15H16ClN3O5S2
Mol. Mass.417.888
SMILESNS(=O)(=O)c1ccc(CCNC(=O)NS(=O)(=O)c2ccccc2Cl)cc1