Reaction Details
TargetCarbonic anhydrase 12
LigandBDBM50030561
Substrate/Competitorn/a
Meas. Tech.ChEMBL_1436382 (CHEMBL3389585)
Ki 0.670000±n/a nM
Citation Bozdag, MFerraroni, MCarta, FVullo, DLucarini, LOrlandini, ERossello, ANuti, EScozzafava, AMasini, ESupuran, CT Structural insights on carbonic anhydrase inhibitory action, isoform selectivity, and potency of sulfonamides and coumarins incorporating arylsulfonylureido groups. J Med Chem57:9152-67 (2014) 
 
Carbonic anhydrase 12
Name:Carbonic anhydrase 12
Type:Enzyme
Mol. Mass.:39456.00
Organism:Homo sapiens (Human)
Description:Catalytic domain of human cloned isozyme was used in the assay
Residue:354
BDBM50030561
NameBDBM50030561
Synonyms:CHEMBL3354129
TypeSmall organic molecule
Emp. Form.C12H11FN4O5S2
Mol. Mass.374.368
SMILESNS(=O)(=O)c1ccc(NC(=O)NS(=O)(=O)c2ccc(F)cc2)cn1