Reaction Details
TargetCarbonic anhydrase 9
LigandBDBM50030618
Substrate/Competitorn/a
Meas. Tech.ChEMBL_1436381 (CHEMBL3389584)
Ki 68±n/a nM
Citation Bozdag, MFerraroni, MCarta, FVullo, DLucarini, LOrlandini, ERossello, ANuti, EScozzafava, AMasini, ESupuran, CT Structural insights on carbonic anhydrase inhibitory action, isoform selectivity, and potency of sulfonamides and coumarins incorporating arylsulfonylureido groups. J Med Chem57:9152-67 (2014) 
 
Carbonic anhydrase 9
Name:Carbonic anhydrase 9
Type:Enzyme
Mol. Mass.:49669.03
Organism:Homo sapiens (Human)
Description:Catalytic domain of human cloned isozyme was used in the assay
Residue:459
BDBM50030618
NameBDBM50030618
Synonyms:CHEMBL3354135
TypeSmall organic molecule
Emp. Form.C15H16FN3O5S2
Mol. Mass.401.433
SMILESNS(=O)(=O)c1ccc(CCNC(=O)NS(=O)(=O)c2ccc(F)cc2)cc1