Reaction Details
TargetCarbonic anhydrase 9
LigandBDBM50030562
Substrate/Competitorn/a
Meas. Tech.ChEMBL_1436381 (CHEMBL3389584)
Ki 9.7±n/a nM
Citation Bozdag, MFerraroni, MCarta, FVullo, DLucarini, LOrlandini, ERossello, ANuti, EScozzafava, AMasini, ESupuran, CT Structural insights on carbonic anhydrase inhibitory action, isoform selectivity, and potency of sulfonamides and coumarins incorporating arylsulfonylureido groups. J Med Chem57:9152-67 (2014) 
 
Carbonic anhydrase 9
Name:Carbonic anhydrase 9
Type:Enzyme
Mol. Mass.:49669.03
Organism:Homo sapiens (Human)
Description:Catalytic domain of human cloned isozyme was used in the assay
Residue:459
BDBM50030562
NameBDBM50030562
Synonyms:CHEMBL3354130
TypeSmall organic molecule
Emp. Form.C12H11ClN4O5S2
Mol. Mass.390.823
SMILESNS(=O)(=O)c1ccc(NC(=O)NS(=O)(=O)c2ccccc2Cl)cn1