Reaction Details
TargetCarbonic anhydrase 1
LigandBDBM50030643
Substrate/Competitorn/a
Meas. Tech.ChEMBL_1436379 (CHEMBL3389582)
Ki 2380±n/a nM
Citation Bozdag, MFerraroni, MCarta, FVullo, DLucarini, LOrlandini, ERossello, ANuti, EScozzafava, AMasini, ESupuran, CT Structural insights on carbonic anhydrase inhibitory action, isoform selectivity, and potency of sulfonamides and coumarins incorporating arylsulfonylureido groups. J Med Chem57:9152-67 (2014) 
 
Carbonic anhydrase 1
Name:Carbonic anhydrase 1
Type:Enzyme
Mol. Mass.:28873.37
Organism:Homo sapiens (Human)
Description:P00915
Residue:261
BDBM50030643
NameBDBM50030643
Synonyms:CHEMBL3354142
TypeSmall organic molecule
Emp. Form.C17H13ClN2O5S
Mol. Mass.392.814
SMILESCc1cc(=O)oc2cc(NC(=O)NS(=O)(=O)c3ccccc3Cl)ccc12