Reaction Details
TargetDeoxycytidine kinase
LigandBDBM50031350
Substrate/Competitorn/a
Meas. Tech.ChEMBL_1437136 (CHEMBL3381705)
Ki 17±n/a nM
Citation Nomme, JLi, ZGipson, RMWang, JArmijo, ALLe, TPoddar, SSmith, TSantarsiero, BDNguyen, HACzernin, JAlexandrova, ANJung, MERadu, CGLavie, A Structure-guided development of deoxycytidine kinase inhibitors with nanomolar affinity and improved metabolic stability. J Med Chem57:9480-94 (2014) 
 
Deoxycytidine kinase
Name:Deoxycytidine kinase
Type:PROTEIN
Mol. Mass.:30510.65
Organism:Homo sapiens (Human)
Description:ChEMBL_1437135
Residue:260
BDBM50031350
NameBDBM50031350
Synonyms:CHEMBL3358093
TypeSmall organic molecule
Emp. Form.C21H26FN5O2S2
Mol. Mass.463.592
SMILESCCCc1sc(nc1C(C)Sc1nc(N)cc(N)n1)-c1ccc(OC)c(OCCF)c1