Reaction Details
TargetDeoxycytidine kinase
LigandBDBM50440178
Substrate/Competitorn/a
Meas. Tech.ChEMBL_1437137 (CHEMBL3381706)
IC50 19±n/a nM
Citation Nomme, JLi, ZGipson, RMWang, JArmijo, ALLe, TPoddar, SSmith, TSantarsiero, BDNguyen, HACzernin, JAlexandrova, ANJung, MERadu, CGLavie, A Structure-guided development of deoxycytidine kinase inhibitors with nanomolar affinity and improved metabolic stability. J Med Chem57:9480-94 (2014) 
 
Deoxycytidine kinase
Name:Deoxycytidine kinase
Type:PROTEIN
Mol. Mass.:30510.65
Organism:Homo sapiens (Human)
Description:ChEMBL_1437135
Residue:260
BDBM50440178
NameBDBM50440178
Synonyms:CHEMBL2426568
TypeSmall organic molecule
Emp. Form.C18H21N5O2S2
Mol. Mass.403.522
SMILESCCCc1sc(nc1CSc1nc(N)cc(N)n1)-c1ccc(OC)c(O)c1