Reaction Details
TargetDeoxycytidine kinase
LigandBDBM50031352
Substrate/Competitorn/a
Meas. Tech.ChEMBL_1437136 (CHEMBL3381705)
Ki 1.8±n/a nM
Citation Nomme, JLi, ZGipson, RMWang, JArmijo, ALLe, TPoddar, SSmith, TSantarsiero, BDNguyen, HACzernin, JAlexandrova, ANJung, MERadu, CGLavie, A Structure-guided development of deoxycytidine kinase inhibitors with nanomolar affinity and improved metabolic stability. J Med Chem57:9480-94 (2014) 
 
Deoxycytidine kinase
Name:Deoxycytidine kinase
Type:PROTEIN
Mol. Mass.:30510.65
Organism:Homo sapiens (Human)
Description:ChEMBL_1437135
Residue:260
BDBM50031352
NameBDBM50031352
Synonyms:CHEMBL3358091
TypeSmall organic molecule
Emp. Form.C22H28N4O3S2
Mol. Mass.460.613
SMILESCCCc1sc(nc1CSc1nccc(N)n1)-c1ccc(OC)c(OCC(C)(C)O)c1