Reaction Details
TargetDeoxycytidine kinase
LigandBDBM50440172
Substrate/Competitorn/a
Meas. Tech.ChEMBL_1437135 (CHEMBL3381704)
IC50 14±n/a nM
Citation Nomme, JLi, ZGipson, RMWang, JArmijo, ALLe, TPoddar, SSmith, TSantarsiero, BDNguyen, HACzernin, JAlexandrova, ANJung, MERadu, CGLavie, A Structure-guided development of deoxycytidine kinase inhibitors with nanomolar affinity and improved metabolic stability. J Med Chem57:9480-94 (2014) 
 
Deoxycytidine kinase
Name:Deoxycytidine kinase
Type:PROTEIN
Mol. Mass.:30510.65
Organism:Homo sapiens (Human)
Description:ChEMBL_1437135
Residue:260
BDBM50440172
NameBDBM50440172
Synonyms:CHEMBL2426574
TypeSmall organic molecule
Emp. Form.C21H28N6O4S3
Mol. Mass.524.68
SMILESCCCc1sc(nc1CSc1nc(N)cc(N)n1)-c1ccc(OC)c(OCCNS(C)(=O)=O)c1