Reaction Details
TargetCarbonic anhydrase 12
LigandBDBM50031577
Substrate/Competitorn/a
Meas. Tech.ChEMBL_1440918 (CHEMBL3375182)
Ki 7.2±n/a nM
Citation Bozdag, MPinard, MCarta, FMasini, EScozzafava, AMcKenna, RSupuran, CT A class of 4-sulfamoylphenyl-¿-aminoalkyl ethers with effective carbonic anhydrase inhibitory action and antiglaucoma effects. J Med Chem57:9673-86 (2014) 
 
Carbonic anhydrase 12
Name:Carbonic anhydrase 12
Type:Enzyme
Mol. Mass.:39456.00
Organism:Homo sapiens (Human)
Description:Catalytic domain of human cloned isozyme was used in the assay
Residue:354
BDBM50031577
NameBDBM50031577
Synonyms:CHEMBL3359164
TypeSmall organic molecule
Emp. Form.C13H20N2O5S
Mol. Mass.316.373
SMILESCC(C)(C)OC(=O)NCCOc1ccc(cc1)S(N)(=O)=O