Reaction Details
TargetCarbonic anhydrase 12
LigandBDBM50031536
Substrate/Competitorn/a
Meas. Tech.ChEMBL_1440918 (CHEMBL3375182)
Ki 7.1±n/a nM
Citation Bozdag, MPinard, MCarta, FMasini, EScozzafava, AMcKenna, RSupuran, CT A class of 4-sulfamoylphenyl-¿-aminoalkyl ethers with effective carbonic anhydrase inhibitory action and antiglaucoma effects. J Med Chem57:9673-86 (2014) 
 
Carbonic anhydrase 12
Name:Carbonic anhydrase 12
Type:Enzyme
Mol. Mass.:39456.00
Organism:Homo sapiens (Human)
Description:Catalytic domain of human cloned isozyme was used in the assay
Residue:354
BDBM50031536
NameBDBM50031536
Synonyms:CHEMBL3359176
TypeSmall organic molecule
Emp. Form.C31H27N3O8S2
Mol. Mass.633.691
SMILESNS(=O)(=O)c1ccc(OCCCCNC(=S)Nc2ccc(c(c2)C(O)=O)-c2c3ccc(O)cc3oc3cc(=O)ccc23)cc1