Reaction Details
TargetCarbonic anhydrase 12
LigandBDBM50031560
Substrate/Competitorn/a
Meas. Tech.ChEMBL_1440918 (CHEMBL3375182)
Ki 609±n/a nM
Citation Bozdag, MPinard, MCarta, FMasini, EScozzafava, AMcKenna, RSupuran, CT A class of 4-sulfamoylphenyl-¿-aminoalkyl ethers with effective carbonic anhydrase inhibitory action and antiglaucoma effects. J Med Chem57:9673-86 (2014) 
 
Carbonic anhydrase 12
Name:Carbonic anhydrase 12
Type:Enzyme
Mol. Mass.:39456.00
Organism:Homo sapiens (Human)
Description:Catalytic domain of human cloned isozyme was used in the assay
Residue:354
BDBM50031560
NameBDBM50031560
Synonyms:CHEMBL3359177
TypeSmall organic molecule
Emp. Form.C33H34ClN5O6S2
Mol. Mass.696.236
SMILES[Cl-].CN(C)c1ccc2c(-c3ccc(NC(=S)NCCOc4ccc(cc4)S(N)(=O)=O)cc3C(O)=O)c3ccc(cc3oc2c1)=[N+](C)C