Reaction Details
TargetCarbonic anhydrase 1
LigandBDBM50031577
Substrate/Competitorn/a
Meas. Tech.ChEMBL_1440915 (CHEMBL3375179)
Ki 5.3±n/a nM
Citation Bozdag, MPinard, MCarta, FMasini, EScozzafava, AMcKenna, RSupuran, CT A class of 4-sulfamoylphenyl-¿-aminoalkyl ethers with effective carbonic anhydrase inhibitory action and antiglaucoma effects. J Med Chem57:9673-86 (2014) 
 
Carbonic anhydrase 1
Name:Carbonic anhydrase 1
Type:Enzyme
Mol. Mass.:28873.37
Organism:Homo sapiens (Human)
Description:P00915
Residue:261
BDBM50031577
NameBDBM50031577
Synonyms:CHEMBL3359164
TypeSmall organic molecule
Emp. Form.C13H20N2O5S
Mol. Mass.316.373
SMILESCC(C)(C)OC(=O)NCCOc1ccc(cc1)S(N)(=O)=O