Reaction Details
TargetCarbonic anhydrase 1
LigandBDBM50031576
Substrate/Competitorn/a
Meas. Tech.ChEMBL_1440915 (CHEMBL3375179)
Ki 151±n/a nM
Citation Bozdag, MPinard, MCarta, FMasini, EScozzafava, AMcKenna, RSupuran, CT A class of 4-sulfamoylphenyl-¿-aminoalkyl ethers with effective carbonic anhydrase inhibitory action and antiglaucoma effects. J Med Chem57:9673-86 (2014) 
 
Carbonic anhydrase 1
Name:Carbonic anhydrase 1
Type:Enzyme
Mol. Mass.:28873.37
Organism:Homo sapiens (Human)
Description:P00915
Residue:261
BDBM50031576
NameBDBM50031576
Synonyms:CHEMBL3359178
TypeSmall organic molecule
Emp. Form.C34H36ClN5O6S2
Mol. Mass.710.263
SMILES[Cl-].CN(C)c1ccc2c(-c3ccc(NC(=S)NCCCOc4ccc(cc4)S(N)(=O)=O)cc3C(O)=O)c3ccc(cc3oc2c1)=[N+](C)C