Reaction Details
TargetCarbonic anhydrase 2
LigandBDBM50031580
Substrate/Competitorn/a
Meas. Tech.ChEMBL_1440916 (CHEMBL3375180)
Ki 5.5±n/a nM
Citation Bozdag, MPinard, MCarta, FMasini, EScozzafava, AMcKenna, RSupuran, CT A class of 4-sulfamoylphenyl-¿-aminoalkyl ethers with effective carbonic anhydrase inhibitory action and antiglaucoma effects. J Med Chem57:9673-86 (2014) 
 
Carbonic anhydrase 2
Name:Carbonic anhydrase 2
Type:Enzyme
Mol. Mass.:29250.71
Organism:Homo sapiens (Human)
Description:P00918
Residue:260
BDBM50031580
NameBDBM50031580
Synonyms:CHEMBL3359167
TypeSmall organic molecule
Emp. Form.C16H26N2O5S
Mol. Mass.358.453
SMILESCC(C)(C)OC(=O)NCCCCCOc1ccc(cc1)S(N)(=O)=O