Reaction Details
TargetCarbonic anhydrase 9
LigandBDBM50031581
Substrate/Competitorn/a
Meas. Tech.ChEMBL_1440917 (CHEMBL3375181)
Ki 6.9±n/a nM
Citation Bozdag, MPinard, MCarta, FMasini, EScozzafava, AMcKenna, RSupuran, CT A class of 4-sulfamoylphenyl-¿-aminoalkyl ethers with effective carbonic anhydrase inhibitory action and antiglaucoma effects. J Med Chem57:9673-86 (2014) 
 
Carbonic anhydrase 9
Name:Carbonic anhydrase 9
Type:Enzyme
Mol. Mass.:49669.03
Organism:Homo sapiens (Human)
Description:Catalytic domain of human cloned isozyme was used in the assay
Residue:459
BDBM50031581
NameBDBM50031581
Synonyms:CHEMBL3359168
TypeSmall organic molecule
Emp. Form.C17H28N2O5S
Mol. Mass.372.48
SMILESCC(C)(C)OC(=O)NCCCCCCOc1ccc(cc1)S(N)(=O)=O