Reaction Details
TargetCarbonic anhydrase 9
LigandBDBM50031582
Substrate/Competitorn/a
Meas. Tech.ChEMBL_1440917 (CHEMBL3375181)
Ki 8.7±n/a nM
Citation Bozdag, MPinard, MCarta, FMasini, EScozzafava, AMcKenna, RSupuran, CT A class of 4-sulfamoylphenyl-¿-aminoalkyl ethers with effective carbonic anhydrase inhibitory action and antiglaucoma effects. J Med Chem57:9673-86 (2014) 
 
Carbonic anhydrase 9
Name:Carbonic anhydrase 9
Type:Enzyme
Mol. Mass.:49669.03
Organism:Homo sapiens (Human)
Description:Catalytic domain of human cloned isozyme was used in the assay
Residue:459
BDBM50031582
NameBDBM50031582
Synonyms:CHEMBL3359169
TypeSmall organic molecule
Emp. Form.C10H13F3N2O5S
Mol. Mass.330.281
SMILES[O-]C(=O)C(F)(F)F.NS(=O)(=O)c1ccc(OCC[NH3+])cc1