Reaction Details
TargetCarbonic anhydrase 9
LigandBDBM50031584
Substrate/Competitorn/a
Meas. Tech.ChEMBL_1440917 (CHEMBL3375181)
Ki 33±n/a nM
Citation Bozdag, MPinard, MCarta, FMasini, EScozzafava, AMcKenna, RSupuran, CT A class of 4-sulfamoylphenyl-¿-aminoalkyl ethers with effective carbonic anhydrase inhibitory action and antiglaucoma effects. J Med Chem57:9673-86 (2014) 
 
Carbonic anhydrase 9
Name:Carbonic anhydrase 9
Type:Enzyme
Mol. Mass.:49669.03
Organism:Homo sapiens (Human)
Description:Catalytic domain of human cloned isozyme was used in the assay
Residue:459
BDBM50031584
NameBDBM50031584
Synonyms:CHEMBL3359171
TypeSmall organic molecule
Emp. Form.C12H17F3N2O5S
Mol. Mass.358.334
SMILES[O-]C(=O)C(F)(F)F.NS(=O)(=O)c1ccc(OCCCC[NH3+])cc1