Reaction Details
TargetCarbonic anhydrase 5A, mitochondrial
LigandBDBM50031588
Substrate/Competitorn/a
Meas. Tech.ChEMBL_1441637 (CHEMBL3377083)
Kd 2500±n/a nM
Citation Dudutiene, VMatuliene, JSmirnov, ATimm, DDZubriene, ABaranauskiene, LMorkunaite, VSmirnoviene, JMichailoviene, VJuozapaitiene, VMickeviciute, AKazokaite, JBak?yte, SKasiliauskaite, AJachno, JRevuckiene, JKi?onaite, MPilipuityte, VIvanauskaite, EMilinaviciute, GSmirnovas, VPetrikaite, VKairys, VPetrauskas, VNorvai?as, PLinge, DGibie?a, PCapkauskaite, EZak?auskas, AKazlauskas, EManakova, EGra?ulis, SLadbury, JEMatulis, D Discovery and characterization of novel selective inhibitors of carbonic anhydrase IX. J Med Chem57:9435-46 (2014) 
 
Carbonic anhydrase 5A, mitochondrial
Name:Carbonic anhydrase 5A, mitochondrial
Type:Enzyme
Mol. Mass.:34755.54
Organism:Homo sapiens (Human)
Description:Human (cloned) isozyme
Residue:305
BDBM50031588
NameBDBM50031588
Synonyms:CHEMBL3359181
TypeSmall organic molecule
Emp. Form.C16H23F3N2O5S2
Mol. Mass.444.489
SMILESNS(=O)(=O)c1c(F)c(F)c(c(NC2CCCCCCC2)c1F)S(=O)(=O)CCO