Reaction Details
TargetCarbonic anhydrase 5B, mitochondrial
LigandBDBM50031589
Substrate/Competitorn/a
Meas. Tech.ChEMBL_1441638 (CHEMBL3377084)
Kd 210±n/a nM
Citation Dudutiene, VMatuliene, JSmirnov, ATimm, DDZubriene, ABaranauskiene, LMorkunaite, VSmirnoviene, JMichailoviene, VJuozapaitiene, VMickeviciute, AKazokaite, JBak?yte, SKasiliauskaite, AJachno, JRevuckiene, JKi?onaite, MPilipuityte, VIvanauskaite, EMilinaviciute, GSmirnovas, VPetrikaite, VKairys, VPetrauskas, VNorvai?as, PLinge, DGibie?a, PCapkauskaite, EZak?auskas, AKazlauskas, EManakova, EGra?ulis, SLadbury, JEMatulis, D Discovery and characterization of novel selective inhibitors of carbonic anhydrase IX. J Med Chem57:9435-46 (2014) 
 
Carbonic anhydrase 5B, mitochondrial
Name:Carbonic anhydrase 5B, mitochondrial
Type:Enzyme
Mol. Mass.:36440.83
Organism:Homo sapiens (Human)
Description:Human (cloned) isozyme
Residue:317
BDBM50031589
NameBDBM50031589
Synonyms:CHEMBL3359179
TypeSmall organic molecule
Emp. Form.C16H23F3N2O3S2
Mol. Mass.412.491
SMILESNS(=O)(=O)c1c(F)c(F)c(SCCO)c(F)c1NC1CCCCCCC1