Reaction Details
TargetCarbonic anhydrase 14
LigandBDBM50429900
Substrate/Competitorn/a
Meas. Tech.ChEMBL_1441646 (CHEMBL3377092)
Kd 5.0±n/a nM
Citation Dudutiene, VMatuliene, JSmirnov, ATimm, DDZubriene, ABaranauskiene, LMorkunaite, VSmirnoviene, JMichailoviene, VJuozapaitiene, VMickeviciute, AKazokaite, JBak?yte, SKasiliauskaite, AJachno, JRevuckiene, JKi?onaite, MPilipuityte, VIvanauskaite, EMilinaviciute, GSmirnovas, VPetrikaite, VKairys, VPetrauskas, VNorvai?as, PLinge, DGibie?a, PCapkauskaite, EZak?auskas, AKazlauskas, EManakova, EGra?ulis, SLadbury, JEMatulis, D Discovery and characterization of novel selective inhibitors of carbonic anhydrase IX. J Med Chem57:9435-46 (2014) 
 
Carbonic anhydrase 14
Name:Carbonic anhydrase 14
Type:Enzyme
Mol. Mass.:37665.67
Organism:Homo sapiens (Human)
Description:Human (cloned) isozyme.
Residue:337
BDBM50429900
NameBDBM50429900
Synonyms:CHEMBL2333417
TypeSmall organic molecule
Emp. Form.C8H7F4NO5S2
Mol. Mass.337.268
SMILESNS(=O)(=O)c1c(F)c(F)c(c(F)c1F)S(=O)(=O)CCO