Reaction Details
TargetMyeloblastin
LigandBDBM50031630
Substrate/Competitorn/a
Meas. Tech.ChEMBL_1442535 (CHEMBL3371659)
IC50 1910±n/a nM
Citation Budnjo, ANarawane, SGrauffel, CSchillinger, ASFossen, TReuter, NHaug, BE Reversible ketomethylene-based inhibitors of human neutrophil proteinase 3. J Med Chem57:9396-408 (2014) 
 
Myeloblastin
Name:Myeloblastin
Type:PROTEIN
Mol. Mass.:27816.30
Organism:Homo sapiens (Human)
Description:ChEMBL_1463425
Residue:256
BDBM50031630
NameBDBM50031630
Synonyms:CHEMBL3359765
TypeSmall organic molecule
Emp. Form.C54H71N13O19
Mol. Mass.1206.2172
SMILESCCC[C@H](NC(=O)[C@H](CC(O)=O)NC(=O)[C@H](C)NC(=O)[C@@H](NC(=O)c1ccccc1N)C(C)C)C(=O)C[C@@H](C)C(=O)N[C@@H](CC(O)=O)C(=O)N[C@@H](Cc1ccc(O)cc1)C(=O)N[C@@H](CCC(N)=O)C(=O)NCCNc1ccc(cc1[N+]([O-])=O)[N+]([O-])=O