Reaction Details
TargetTyrosine-protein kinase JAK2
LigandBDBM103737
Substrate/Competitorn/a
Meas. Tech.ChEMBL_1433466 (CHEMBL3382736)
IC50>10000±n/a nM
Citation Menet, CJFletcher, SRVan Lommen, GGeney, RBlanc, JSmits, KJouannigot, NDeprez, Pvan der Aar, EMClement-Lacroix, PLepescheux, LGalien, RVayssiere, BNelles, LChristophe, TBrys, RUhring, MCiesielski, FVan Rompaey, L Triazolopyridines as selective JAK1 inhibitors: from hit identification to GLPG0634. J Med Chem57:9323-42 (2014) 
 
Tyrosine-protein kinase JAK2
Name:Tyrosine-protein kinase JAK2
Type:Protein
Mol. Mass.:130684.68
Organism:Homo sapiens (Human)
Description:O60674
Residue:1132
BDBM103737
NameBDBM103737
Synonyms:US10206907, Compound 234 US8563545, 11
TypeSmall organic molecule
Emp. Form.C22H23F2N5O
Mol. Mass.411.4477
SMILESFC1(F)CCN(Cc2ccc(cc2)-c2cccc3nc(NC(=O)C4CC4)nn23)CC1