Reaction Details
TargetTyrosine-protein kinase JAK2
LigandBDBM50031737
Substrate/Competitorn/a
Meas. Tech.ChEMBL_1433466 (CHEMBL3382736)
IC50>100000±n/a nM
Citation Menet, CJFletcher, SRVan Lommen, GGeney, RBlanc, JSmits, KJouannigot, NDeprez, Pvan der Aar, EMClement-Lacroix, PLepescheux, LGalien, RVayssiere, BNelles, LChristophe, TBrys, RUhring, MCiesielski, FVan Rompaey, L Triazolopyridines as selective JAK1 inhibitors: from hit identification to GLPG0634. J Med Chem57:9323-42 (2014) 
 
Tyrosine-protein kinase JAK2
Name:Tyrosine-protein kinase JAK2
Type:Protein
Mol. Mass.:130684.68
Organism:Homo sapiens (Human)
Description:O60674
Residue:1132
BDBM50031737
NameBDBM50031737
Synonyms:CHEMBL3360840
TypeSmall organic molecule
Emp. Form.C17H19N5O2S
Mol. Mass.357.43
SMILESNc1nc2cccc(-c3ccc(CN4CCS(=O)(=O)CC4)cc3)n2n1