Reaction Details
TargetMitogen-activated protein kinase 14
LigandBDBM50031747
Substrate/Competitorn/a
Meas. Tech.ChEMBL_1432593 (CHEMBL3388152)
IC50>10000±n/a nM
Citation Menet, CJFletcher, SRVan Lommen, GGeney, RBlanc, JSmits, KJouannigot, NDeprez, Pvan der Aar, EMClement-Lacroix, PLepescheux, LGalien, RVayssiere, BNelles, LChristophe, TBrys, RUhring, MCiesielski, FVan Rompaey, L Triazolopyridines as selective JAK1 inhibitors: from hit identification to GLPG0634. J Med Chem57:9323-42 (2014) 
 
Mitogen-activated protein kinase 14
Name:Mitogen-activated protein kinase 14
Type:Serine/threonine-protein kinase
Mol. Mass.:41286.76
Organism:Homo sapiens (Human)
Description:Q16539
Residue:360
BDBM50031747
NameBDBM50031747
Synonyms:CHEMBL3360318
TypeSmall organic molecule
Emp. Form.C17H16N4O2
Mol. Mass.308.3345
SMILESCOc1ccc(cc1)-c1cccc2nc(NC(=O)C3CC3)nn12