Reaction Details
TargetProtein-tyrosine kinase 2-beta
LigandBDBM50031747
Substrate/Competitorn/a
Meas. Tech.ChEMBL_1432595 (CHEMBL3388154)
IC50 3184±n/a nM
Citation Menet, CJFletcher, SRVan Lommen, GGeney, RBlanc, JSmits, KJouannigot, NDeprez, Pvan der Aar, EMClement-Lacroix, PLepescheux, LGalien, RVayssiere, BNelles, LChristophe, TBrys, RUhring, MCiesielski, FVan Rompaey, L Triazolopyridines as selective JAK1 inhibitors: from hit identification to GLPG0634. J Med Chem57:9323-42 (2014) 
 
Protein-tyrosine kinase 2-beta
Name:Protein-tyrosine kinase 2-beta
Type:Protein
Mol. Mass.:115868.80
Organism:Homo sapiens (Human)
Description:Q14289
Residue:1009
BDBM50031747
NameBDBM50031747
Synonyms:CHEMBL3360318
TypeSmall organic molecule
Emp. Form.C17H16N4O2
Mol. Mass.308.3345
SMILESCOc1ccc(cc1)-c1cccc2nc(NC(=O)C3CC3)nn12