Reaction Details
TargetTyrosine-protein kinase JAK1
LigandBDBM50031806
Substrate/Competitorn/a
Meas. Tech.ChEMBL_1432584 (CHEMBL3388143)
IC50 67±n/a nM
Citation Menet, CJFletcher, SRVan Lommen, GGeney, RBlanc, JSmits, KJouannigot, NDeprez, Pvan der Aar, EMClement-Lacroix, PLepescheux, LGalien, RVayssiere, BNelles, LChristophe, TBrys, RUhring, MCiesielski, FVan Rompaey, L Triazolopyridines as selective JAK1 inhibitors: from hit identification to GLPG0634. J Med Chem57:9323-42 (2014) 
 
Tyrosine-protein kinase JAK1
Name:Tyrosine-protein kinase JAK1
Type:Protein
Mol. Mass.:133293.73
Organism:Homo sapiens (Human)
Description:P23458
Residue:1154
BDBM50031806
NameBDBM50031806
Synonyms:CHEMBL3360343
TypeSmall organic molecule
Emp. Form.C18H18N4O2
Mol. Mass.322.3611
SMILESCCOc1ccc(cc1)-c1cccn2nc(NC(=O)C3CC3)nc12