Reaction Details
TargetEctonucleotide pyrophosphatase/phosphodiesterase family member 1
LigandBDBM50031821
Substrate/Competitorn/a
Meas. Tech.ChEMBL_1437888 (CHEMBL3384852)
Ki 11000±n/a nM
Citation Chang, LLee, SYLeonczak, PRozenski, JDe Jonghe, SHanck, TMüller, CEHerdewijn, P Imidazopyridine- and purine-thioacetamide derivatives: potent inhibitors of nucleotide pyrophosphatase/phosphodiesterase 1 (NPP1). J Med Chem57:10080-100 (2014) 
 
Ectonucleotide pyrophosphatase/phosphodiesterase family member 1
Name:Ectonucleotide pyrophosphatase/phosphodiesterase family member 1
Type:PROTEIN
Mol. Mass.:104934.43
Organism:Homo sapiens (Human)
Description:ChEMBL_1448940
Residue:925
BDBM50031821
NameBDBM50031821
Synonyms:CHEMBL3360896
TypeSmall organic molecule
Emp. Form.C18H22N6O4S
Mol. Mass.418.47
SMILESCOc1ccc(NC(=O)CSc2nc3c(OC(C)C)nc(N)nc3[nH]2)cc1OC