Reaction Details
TargetEctonucleotide pyrophosphatase/phosphodiesterase family member 1
LigandBDBM50031823
Substrate/Competitorn/a
Meas. Tech.ChEMBL_1437890 (CHEMBL3384854)
Ki 8040±n/a nM
Citation Chang, LLee, SYLeonczak, PRozenski, JDe Jonghe, SHanck, TMüller, CEHerdewijn, P Imidazopyridine- and purine-thioacetamide derivatives: potent inhibitors of nucleotide pyrophosphatase/phosphodiesterase 1 (NPP1). J Med Chem57:10080-100 (2014) 
 
Ectonucleotide pyrophosphatase/phosphodiesterase family member 1
Name:Ectonucleotide pyrophosphatase/phosphodiesterase family member 1
Type:PROTEIN
Mol. Mass.:104934.43
Organism:Homo sapiens (Human)
Description:ChEMBL_1448940
Residue:925
BDBM50031823
NameBDBM50031823
Synonyms:CHEMBL3360894
TypeSmall organic molecule
Emp. Form.C16H18N6O4S
Mol. Mass.390.417
SMILESCOc1ccc(NC(=O)CSc2nc3c(OC)nc(N)nc3[nH]2)cc1OC